{"text_format":"1","workbook":"xlsx","n_sheets":10,"sheets":["Read me","Tab 1 - Assumptions","Tab 2 - Rate Summary","Tab 3 - Unlevied Land","Tab 4 - Infrastructure","Tab 5 - Benefit Allocation","Tab 6 - Financial Model","Tab 7 - Bylaw Continuity","Tab 8 - Population Forecast","Tab 9 - Existing Capacity"],"not_rendered":{"charts":1,"images":2,"macros":1,"external_links":1,"defined_names":35,"comments":0,"pivot_tables":0},"unopened":[],"bounds":{"document_bytes":16777216,"sheet_cells":100000,"rows_first":2000,"rows_last":500,"rows_between":2000,"halvings":0,"cell_chars":16384,"cell_head_chars":4096},"cells_cut":0,"cells_raw":0,"read":"whole","date_system":"1900"}

{"sheet":"Read me","index":0,"n_rows":15,"n_cols":3,"rows_kept":15,"cut":false,"hidden":false,"merged":[[1,0,2,2]]}
["HOW TO USE THIS DOCUMENT"]
["Welcome to the model used to determine the police levy rate for the 2024 Off-site Levies Bylaw.\nNote: This model is in DRAFT form for discussion purposes, using the latest information and assumptions available. \n"]
[]
["Last Updated:","July 2023"]
["Police Levy Tabs 1 - 9"]
["Tab number","Title","Description "]
["Tab 1","Assumptions","This tab entails the assumptions and steps to create the financial model. It also provides some details to clarify questions around the assumptions. "]
["Tab 2","Rate Summary","This tab provides a high level summary of the steps that are taken to determine the police levy rate calculation, and provides a look at the proposed levy rate. "]
["Tab 3","Unlevied Land","This tab describes the remaining unlevied land that is included in the model."]
["Tab 4","Infrastructure","This tab provides details on police projects that need to be built over the model period to support the growth of communities in Greenfield Area within Calgary city limits."]
{"$rows_left_out":6}
{"sheet":"Tab 1 - Assumptions","index":1,"n_rows":15,"n_cols":2,"rows_kept":15,"cut":false,"hidden":false,"merged":[[1,0,1,1],[2,0,2,1],[5,0,5,1]]}
["Police - Assumptions"]
["Summary","Frequently Asked Questions"]
["The City will use this financial model to calculate a police off-site levy rate per hectare that incorporates investment income, capital cost escalations, and the timing of expenditures and developer contributions through the model period. The levy rate calculated ensures that the off-site levy balance at the end of the model period is zero (i.e., revenues have matched expenditures). It also incorporates, if necessary, any interest costs incurred from the use of alternative funding sources required to deliver infrastructure in a timely manner."]
[]
[]
["Assumptions"]
["Escalation rate","The escalation factor of 3.58% is a five-year smoothed average, determined using Non-Residential Building Construction Price Index (CPI) for Calgary."]
["Discount rate","The discount rate of 4.29% is based on the asset mix of investments held in The City's capital deposits, and the Long term Capital Market assumptions that The City uses in projecting returns from investment portfolios."]
["Gross developable land","Gross developable lands are calculated starting with the gross land area and deducting non-developable lands."]
["Unlevied land","Unlevied land includes all gross developable lands outside the off-site levy Established Area boundary that do not have executed development agreements. This was 14,211.1 hectares at the end of 2022, and is forecast to be 13,921.1 hectares at the end of 2023."]
{"$rows_left_out":6}
{"sheet":"Tab 2 - Rate Summary","index":2,"n_rows":29,"n_cols":9,"rows_kept":29,"cut":false,"hidden":false,"merged":[[3,1,20,4]]}
["Police - Rate Summary"]
["Proposed 2024 Levy Rate",null,null,null,null,"Figure 1. Off-site levy rate calculation"]
[]
[null,"The levy rate calculation is being adjusted from the simple formula of Costs x Benefit / Land to the model described in Figure 1 to the right, and in the text below. \n\nThis financial model uses the following inputs: \n• Total unlevied land, and annual land absorption.\n• The off-site levy payment schedule.\n• Total capital costs of new infrastructure being levied for, with the benefit allocations to determine total unlevied costs.\n• Annual expenditures.\n• An escalation factor to calculate the future value of project costs.\n• A discount factor to calculate the discounted value of project costs, future revenue from developer contributions, and annual investment income or interest expense.\n\nThe levy rate is then calculated using Excel's Goal Seek function to find the levy rate that balances all expenditures and revenues over the course of the model to result in an off-site levy balance of $0.\n"]
[]
[]
[]
[]
[]
[]
{"$rows_left_out":20}
{"sheet":"Tab 3 - Unlevied Land","index":3,"n_rows":5,"n_cols":17,"rows_kept":5,"cut":false,"hidden":false,"merged":[[1,0,3,13],[4,0,19,13]]}
["Police - Unlevied Land"]
["This tab provides background on different benefiting areas: the Established Area, unlevied land, and land that has already been levied.",null,null,null,null,null,null,null,null,null,null,null,null,null,null,null,"Map 1. Off-site levy Established Area boundary and unlevied lands as of the end of 2022"]
[]
[]
["Map 1 to the right illustrates The City's Established Area, and Greenfield Area.\n\nThe Established Area boundary was identified in the 2016 Off-site Levy Bylaw and contains lands that are fully developed, or have executed development agreement to allow future development. The purpose of the boundary is to determine benefiting areas in support of levy rate calculations (established or greenfield) for different parts of the city.\n\nLand shown in green includes both greenfield lands that have already been levied, unlevied, and non-developable land. Non-developable land is excluded from the determination of the number of hectares that have been levied or unlevied. This includes, for example:\n\t• The Transportation Utility Corridor (TUC), or road right-of-way for provincial expressways.\n\t• Environmental Reserve (slopes with a grade greater than 15%, natural water bodies, areas impacted by a 1:100 year flood).\n\t• Landfills.\n\t• Cemeteries."]

{"sheet":"Tab 4 - Infrastructure","index":4,"n_rows":30,"n_cols":9,"rows_kept":30,"cut":false,"hidden":false,"merged":[[4,2,4,5],[5,2,5,5],[6,2,6,5]]}
[null,"Police - Infrastructure"]
[]
[null,"This tab shows the basis of the calculation and assumptions used in assessing infrastructure allocation."]
[]
[null,"Per facility capacity","The service level for the greenfield is comparable with the service level in the Established Area (one facility is needed to service future 149,000 population needs)."]
[null,"Capacity allocation","Future greenfield population will be 100% benefitting with existing and future recreation facilities in the green area"]
[null,"Construction year","Determined based on when the new facility will be required as related to the pace of population growth"]
[]
[null,"Future need of facility and cost analysis"]
[]
{"$rows_left_out":21}
{"sheet":"Tab 5 - Benefit Allocation","index":5,"n_rows":18,"n_cols":6,"rows_kept":18,"cut":false,"hidden":false,"merged":[[8,0,12,0],[8,1,12,4],[0,15,0,27],[1,19,1,25],[4,1,4,4],[5,1,5,4],[6,1,6,4],[7,1,7,4]]}
["Police - Benefit Allocation"]
[]
["This tab provides details on the benefit methodology. It shows the basis of the calculation and assumptions used in assessing benefit allocation."]
[]
["Benefit measurement","Police benefit is measured using the share of population in benefiting areas."]
["Benefiting areas","Greenfield only: projects that support Area Structure Plans (ASPs) outside the Established Area boundary.  The service level for the Greenfield Area is comparable with the service level in the Established Area. 100% of benefit is assigned to the greenfield ASP lands, and is split based on the forecast population in lands that have already signed development agreements and paid off-site levies (levied lands), and lands that have not yet signed development agreements and paid off-site levies (unlevied lands)."]
["Data source","Source: Calgary Next 20: Population, Employment and Housing Projections, 2021, by Applications Management Consulting Ltd.\nA buildout forecast of population based on current growth trends."]
["Source data details and assumptions","• The forecast period ends in 2058.\n• Population forecast is assessed by Transportation Zones (TZs). Transportation Zones provide a useful and reasonable geographic division for forecasting.\n• Population densities are assumed to be even throughout TZs (e.g., where part of a TZ has paid levies, and part has not)."]
["Benefit allocation calculation"," Benefit = (Sum of forecast population in all unlevied lands)/(Sum of forecast population in all greenfield lands)."]
[]
{"$rows_left_out":9}
{"sheet":"Tab 6 - Financial Model","index":6,"n_rows":52,"n_cols":47,"rows_kept":52,"cut":false,"hidden":false,"merged":[[10,1,10,8],[35,6,38,6],[46,2,48,4],[3,1,8,8],[39,2,44,2]]}
[null,"Police OSL Financial Rate Model"]
[]
[null,"Police Levy Rate",null,null,null,7438.1619199162542,"End Value (CELL AU42):",null,{"$f":"AU42","v":0}]
[null,"How to calculate the levy rate: Once all variables have been set, the levy rate can be recalculated by running Excel's Goal Seek function (Data --> What-If Analysis --> Goal Seek) to calculate the levy rate in cell F3 by setting cell AU42 to 0 by changing the levy rate in cell F3. The model applies the value in cell F3 to the land absorption in row 29, to ensure that contributions from Development Agreements (in row 34) plus earned investment income offset total spending and ensure that the ending balance is zero (cell AU42), i.e., all revenues and spending have balanced. \nVariables impacting this calculation include: annual expenditures, land absorption rate, payment schedule (cells I36 to I39), and the escalation and discount rates (cells E25 and E26)."]
[]
[]
[]
[]
[]
[null,"Section 1: Expenditures"]
{"$rows_left_out":43}
{"sheet":"Tab 7 - Bylaw Continuity","index":7,"n_rows":73,"n_cols":43,"rows_kept":73,"cut":false,"hidden":false,"merged":[[68,0,69,0],[71,0,72,0],[2,0,4,1],[5,0,5,1],[6,0,6,1],[54,0,57,0],[60,0,61,0],[63,0,66,0]]}
["Police OSL Continuity"]
[]
["This sheet is for information purposes only. It shows the continuity of expenditures, developer contributions, investment income, and fund balances for both the 2016 and 2024 Off-site Levies Bylaws. Any final investment income earned in the final year will be applied to expenditures in that year."]
[]
[]
["Light green references the 2016 bylaw"]
["Light orange references the 2024 bylaw"]
[]
["2024 Levy Rate",null,null,"Year #",null,null,null,0,1,2,3,4,5,6,7,8,9,10,11,12,13,14,15,16,17,18,19,20,21,22,23,24,25,26,27,28,29,30,31,32,33,34,35]
[{"$f":"'Tab 6 - Financial Model'!F3","v":7438.1619199162542},null,null,"Year",2020,2021,2022,2023,2024,2025,2026,2027,2028,2029,2030,2031,2032,2033,2034,2035,2036,2037,2038,2039,2040,2041,2042,2043,2044,2045,2046,2047,2048,2049,2050,2051,2052,2053,2054,2055,2056,2057,2058]
{"$rows_left_out":64}
{"sheet":"Tab 8 - Population Forecast","index":8,"n_rows":461,"n_cols":17,"rows_kept":461,"cut":false,"hidden":false,"merged":[]}
["Police - Benefit Share Details"]
[]
["TZ1919","Location","Levied land (ha)","Unlevied land (ha)","Total land (ha)","Benefit share (levied land)","Benefit share (unlevied land)","Total share","Total population","Plan type","Levied","Unlevied",null,null,"Row Labels","Sum of Levied","Sum of Leviable"]
[501,"Outside_levy_boundary",57.0636011709,4.5788297042E-4,57.064059053870423,0.99999197598316669,8.0240168332179604E-6,0.99999999999999989,{"$f":"VLOOKUP($A4,[1]allTZs!$B$1:$Y$1402,17,FALSE)","v":2577.8124827000001},{"$f":"VLOOKUP($A4,[1]allTZs!$B$1:$Y$1402,23,FALSE)","v":"Buildout"},{"$f":"$I4*F4","v":2577.7917982892459},{"$f":"$I4*G4","v":2.0684410754064183E-2},null,null,"Area Structure Plan",448287.9088240494,416991.43787445547]
[502,"Outside_levy_boundary",46.063400876899998,0,46.063400876899998,1,0,1,{"$f":"VLOOKUP($A5,[1]allTZs!$B$1:$Y$1402,17,FALSE)","v":2188.8626342100001},{"$f":"VLOOKUP($A5,[1]allTZs!$B$1:$Y$1402,23,FALSE)","v":"Buildout"},{"$f":"$I5*F5","v":2188.8626342100001},0,null,null,"Buildout",37643.396969918045,17.976383964498833]
[503,"Outside_levy_boundary",26.249627691099999,0,26.249627691099999,1,0,1,{"$f":"VLOOKUP($A6,[1]allTZs!$B$1:$Y$1402,17,FALSE)","v":799.17687227600004},{"$f":"VLOOKUP($A6,[1]allTZs!$B$1:$Y$1402,23,FALSE)","v":"Buildout"},799.17687227600004,0,null,null,"Community Plan",43894.606030096096,9.9560903907057269E-2]
[504,"Outside_levy_boundary",63.281117571000003,0,63.281117571000003,1,0,1,{"$f":"VLOOKUP($A7,[1]allTZs!$B$1:$Y$1402,17,FALSE)","v":2690.096043},{"$f":"VLOOKUP($A7,[1]allTZs!$B$1:$Y$1402,23,FALSE)","v":"Buildout"},2690.096043,0,null,null,"Unplanned",601.55756605499857,271005.67363714508]
[505,"Outside_levy_boundary",13.288854669899999,0,13.288854669899999,1,0,1,{"$f":"VLOOKUP($A8,[1]allTZs!$B$1:$Y$1402,17,FALSE)","v":294.71664025799998},{"$f":"VLOOKUP($A8,[1]allTZs!$B$1:$Y$1402,23,FALSE)","v":"Buildout"},294.71664025799998,0,null,null,"Grand Total",530427.46939011849,688015.18745646894]
[506,"Outside_levy_boundary",38.278899068199998,0,38.278899068199998,1,0,1,{"$f":"VLOOKUP($A9,[1]allTZs!$B$1:$Y$1402,17,FALSE)","v":1469.2807668600001},{"$f":"VLOOKUP($A9,[1]allTZs!$B$1:$Y$1402,23,FALSE)","v":"Buildout"},1469.2807668600001,0]
[507,"Outside_levy_boundary",69.92959046,0,69.92959046,1,0,1,{"$f":"VLOOKUP($A10,[1]allTZs!$B$1:$Y$1402,17,FALSE)","v":2106.0408049399998},{"$f":"VLOOKUP($A10,[1]allTZs!$B$1:$Y$1402,23,FALSE)","v":"Buildout"},2106.0408049399998,0,null,null,"Greenfield  ASP population "]
{"$rows_left_out":452}
{"sheet":"Tab 9 - Existing Capacity","index":9,"n_rows":8,"n_cols":2,"rows_kept":8,"cut":false,"hidden":false,"merged":[]}
["Police - Existing Facilities Capacity"]
[]
["Total existing and funded police district office capacity in the Greenfield Area (people)",{"$f":"SUM(B6:B8)","v":372500}]
[]
["Facility ","Capacity (population)"]
["Police District Office 5",{"$f":"149000/2","v":74500}]
["Police District Office 7",149000]
["Police District Office 9",149000]