{"text_format":"1","workbook":"xlsx","n_sheets":10,"sheets":["Read me","Tab 1 - Assumptions","Tab 2 - Rate Summary","Tab 3 - Unlevied Land","Tab 4 - Infrastructure","Tab 5 - Forecast Data","Tab 6 - Benefit Calculation","Tab 7 - Financial Model","Version History","Tab 3 - Financial Model (2)"],"not_rendered":{"charts":1,"images":2,"macros":1,"external_links":0,"defined_names":56,"comments":1,"pivot_tables":0},"unopened":[],"bounds":{"document_bytes":16777216,"sheet_cells":100000,"rows_first":2000,"rows_last":500,"rows_between":2000,"halvings":0,"cell_chars":16384,"cell_head_chars":4096},"cells_cut":0,"cells_raw":0,"read":"whole","date_system":"1900"}

{"sheet":"Read me","index":0,"n_rows":15,"n_cols":3,"rows_kept":15,"cut":false,"hidden":false,"merged":[[1,0,2,2]]}
["HOW TO USE THIS DOCUMENT"]
["Welcome to the model used to determine the levy rates for transit buses as part of the 2024 Off-site Levies Bylaw Review. \nNote: This model is in DRAFT form for discussion purposes, using the latest information and assumptions available. \n"]
[]
["Last Updated:","2023-07-19"]
[]
["Transit Bus Levy Tabs 1 - 7"]
["Tab Number","Title","Description "]
["Tab 1","Assumptions","This tab entails the assumptions and steps to create the financial model. It also provides some details to clarify questions around the assumptions. "]
["Tab 2","Rate Summary ","This tab provides a high level summary of the steps that are taken to determine the transit bus levy rate calculation, and provides a look at the proposed levy rate."]
["Tab 3","Unlevied Land","This tab describes the remaining unlevied land that is included in the model."]
["Tab 4","Infrastructure","This tab provides details on the determination of the number of additional transit buses needed to support new growth in approved greenfield Area Structure Plans. "]
["Tab 5","Forecast Data","This tab provides the detailed forecast data used to determine the infrastructure need."]
["Tab 6","Benefit Allocation","This tab provides the benefit rate allocation to the forecast population in unlevied lands within approved greenfield Area Structure Plans."]
["Tab 7","Financial Model","This tab provides the financial modelling and a detailed calculation of the proposed levy rate."]
["Tab 8","Version History","Draft version dated Wednesday, July 19, 2023"]

{"sheet":"Tab 1 - Assumptions","index":1,"n_rows":15,"n_cols":2,"rows_kept":15,"cut":false,"hidden":false,"merged":[[2,0,2,1],[5,0,5,1],[1,0,1,1]]}
["Transit Buses - Assumptions"]
["Summary","Frequently Asked Questions"]
["The City will use this financial model to calculate a transit bus off-site levy rate per hectare that incorporates investment income, capital cost escalations, and the timing of expenditures and developer contributions through the model period. The levy rate calculated ensures that the off-site levy balance at the end of the model period is zero (i.e., revenues have matched expenditures). It also incorporates, if necessary, any interest costs incurred from the use of alternative funding sources required to deliver infrastructure in a timely manner."]
[]
[]
["Assumptions"]
["Escalation rate","The escalation factor of 3.58% is a five-year smoothed average, determined using Non-Residential Building Construction Price Index (CPI) for Calgary."]
["Discount rate","The discount rate of 4.29% is based on the asset mix of the investments held on The City's capital deposits, and the Long-term Capital Market assumptions that The City uses in projecting returns from investment portfolios."]
["Gross developable land","Gross developable lands are calculated starting with the gross land area and deducting non-developable lands."]
["Unlevied land","Unlevied land includes all gross developable lands outside the off-site levy Established Area boundary that do not have executed development agreements, as of the end of 2022. This was 14,211.1 hectares at the end of 2022, and is forecast to be 13,921.1 hectares at the end of 2023."]
["Land absorption","• All remaining unlevied hectares will sign development agreements within the forecast period (ending 2076).\n• The land absorption from 2023 to 2027 is based on the fall 2022 forecast by Corporate Economics. \n• Remaining unlevied hectares in current and future Area Structure Plans are assumed to follow a decreasing trend over the forecast period, on the expectation of higher densities supporting the same number of people."]
["Benefit allocation","Benefit allocation considers the land that will benefit from infrastructure being levied for and relates to the forecast residents in that land. "]
["Payment schedule","This financial model incorporates the current levy payment schedule, where 100% of transit bus levies are paid in year three after the development agreement is signed."]
["Investment income on future value of cash flows","Investment income is earned on the off-site levy beginning account balance, plus collections and minus spending through the year. Investment income on collections and spending is multiplied by a cashflow timing factor of 0.5 to reflect the fact that the timing of collection and spending varies throughout the year. If the balance of the off-site levy goes negative then interest is charged on the balance of the shortfall."]
["Expenditures","• Purchases of additional buses will depend on corresponding Council approvals for increased operating budgets to pay for bus drivers, increase maintenance capacity, etc.\n• For this model it is assumed that purchases will include 20 buses, as and when sufficient funds are available in the off-site levy balance."]

{"sheet":"Tab 2 - Rate Summary","index":2,"n_rows":28,"n_cols":12,"rows_kept":28,"cut":false,"hidden":false,"merged":[[21,9,21,11],[21,6,21,7],[3,1,17,4]]}
["Transit Buses - Rate Summary"]
["Proposed 2024 Levy Rate",null,null,null,null,"Figure 1. Off-site levy rate calculation"]
[]
[null,"The levy rate calculation is being adjusted from the simple formula of Costs x Benefit / Land to the model described in Figure 1 to the right, and in the text below. \n\nThis financial model uses the following inputs: \n• Total unlevied land, and annual land absorption.\n• The off-site levy payment schedule.\n• Total capital costs of infrastructure being levied for, with the benefit allocations to determine total costs being levied for.\n• Annual expenditures.\n• An escalation factor to calculate the future value of project costs.\n• A discount factor to calculate the discounted value of project costs, future revenue from developer contributions, and annual investment income.\n\nThe levy rate is then calculated using Excel's Goal Seek function to find the levy rate that balances all expenditures and revenues over the course of the model to result in an off-site levy balance of $0.\n"]
[]
[]
[]
[]
[]
[]
[]
[]
[]
[]
[]
[]
[]
[]
[]
[]
{"$rows_left_out":9}
{"sheet":"Tab 3 - Unlevied Land","index":3,"n_rows":5,"n_cols":17,"rows_kept":5,"cut":false,"hidden":false,"merged":[[1,0,3,13],[4,0,22,13]]}
["Transit Buses - Unlevied Land"]
["This tab provides background on different benefiting areas: the Established Area, unlevied land, and land that has already been levied.",null,null,null,null,null,null,null,null,null,null,null,null,null,null,null,"Figure 2. Off-Site levy Established Area boundary, and unlevied lands as of the end of 2022"]
[]
[]
["Figure 2 to the right illustrates The City's Established Area and Greenfield Area; unlevied lands in current Area Structure Plans (ASPs), and land in future ASPs.\n\nThe Established Area boundary was identified in 2016 Off-site Levies Bylaw and contains lands that are fully developed, or have executed development agreement to allow future development. The purpose of the boundary is to determine benefiting areas in support of levy rate calculations (established or greenfield) for different parts of the city.\n\nUnlevied lands, shown in green, includes all gross developable lands in approved ASP's outside the off-site levy Established Area boundary that do not have an executed development agreement, as of the end of 2022. The off-site levy rate calculation excludes the forecast land absorption for 2023.\n\nFuture ASP's are shown in orange. These lands are not currently being considered for the transit bus off-site levy. The formula for infrastructure needs will be reviewed when new ASP's are approved.\n\nLand shown in yellow includes both greenfield lands that have already been levied, and non-developable land. Non-developable land is excluded from the determination of the number of hectares that have been levied or are unlevied. This includes, for example:\n\t• The Transportation Utility Corridor (TUC), or road right-of-way for provincial expressways.\n\t• Environmental Reserve (slopes with a grade greater than 15%, natural water bodies, areas impacted by a 1:100 year flood).\n\t• Landfills.\n\t• Cemeteries."]

{"sheet":"Tab 4 - Infrastructure","index":4,"n_rows":28,"n_cols":9,"rows_kept":28,"cut":false,"hidden":false,"merged":[[14,3,14,5],[1,0,2,5],[5,0,11,5]]}
["Transit Buses - Infrastructure Being Levied For"]
["This tab provides the details on costs that will be eligible for levy funding in the 2024 Off-Site Levies Bylaw. Costs are current to Q2 2023."]
[]
["Last Updated:","2023-07-17"]
[]
["The infrastructure need (number of transit buses) is based on a citywide population-to-fleet ratio, which measures the total population in Calgary to the number of transit buses in service. This ratio changes year-to-year as the population grows annually, while buses are purchased less frequently. An average has been taken from three years to calculate the ratio of the total population for each transit bus in service. Transit service in the greenfield will include a combination of primary transit service (seven MAX routes and several other Bus Rapid Transit (BRT) routes), and community routes.\n\nThe additional fleet needed is calculated as the forecast population in approved greenfield Area Structure Plans divided by the citywide population-to-fleet ratio."]
[]
[]
[]
[]
[]
[]
[]
[null,"Level of Service and Infrastructure Need Calculation"]
[null,null,null,"Actuals"]
[null,null,"Off-Site Levy Calculation",2016,2019,2022]
[null,"# Buses (40' only)",{"$f":"AVERAGE(D17:F17)","v":739.33333333333337},732,744,742]
[null,"# People",{"$f":"AVERAGE(D18:F18)","v":1303238.3333333333},1235171,1285344,1389200]
[null,"# People per 1 bus",{"$f":"C18/C17","v":1762.7209197475202},{"$f":"D18/D17","v":1687.3920765027322},1727.6129032258063,1872.2371967654988]
[null,"Forecast population in unlevied ASP lands",{"$f":"'Tab 5 - Forecast Data'!X6","v":416991.45855886623}]
{"$rows_left_out":9}
{"sheet":"Tab 5 - Forecast Data","index":5,"n_rows":1409,"n_cols":25,"rows_kept":1409,"cut":false,"hidden":false,"merged":[[1,0,3,9]]}
["Transportation - Detailed Forecast Data"]
["This tab provides the detailed forecast data used to calculate benefit allocations. Please note that the total unlevied hectares in this table reflects the total as of the end of 2022; 14,211 hectares. In Tab 7, the denominator of 13,921 hectares reflects a further subtraction of 290 hectares per the Corporate Economics forecast for 2023."]
[]
[]
[]
["Detailed Forecast Data",null,null,null,null,null,"Totals",{"$f":"SUM(H9:H1409)","v":13146.751307130096},{"$f":"SUM(I9:I1409)","v":14211.103115394671},null,null,null,{"$f":"SUM(M9:M1409)","v":2318515.8750930666},1068287.7331272447,531215.38756461744,719012.75440120336,1410380.2223723445,1093651.9279380413,238427.86068930887,78300.43374499341,2161939.6610652907,769643.24825392652,797313.18814619654,416991.45855886623,76748.222595858417]
[]
["Transportation Zone","Municipality","MDP Zone","Community Name","OSL Location","Approved Growth","Total Developable Ha (levied and unlevied)","Levied Ha","Unlevied Ha","% Levied","% Unlevied","% Approved ASPs","2076 Total Population","Population: Established ","Population: Levied ","Population: Unlevied ","2076 Total Jobs","Jobs: Established ","Jobs: Levied ","Jobs: Unlevied ","Population + Jobs: Established","Population + Jobs: Levied","Population + Jobs: Unlevied","Population: Unlevied Current ASPs","Jobs: Unlevied Current ASPs"]
[101,"Calgary","Developed","DOWNTOWN WEST END","Established","EA",15.2982766706,0,0,{"$f":"IF(H9>0,H9/G9,0)","v":0},{"$f":"IF(E9=\"Greenfield\",1-J9,0)","v":0},{"$f":"IF(F9=\"Current ASP\",IF(ISERROR(VLOOKUP(A9,#REF!,3,FALSE)),1,1-VLOOKUP(A9,#REF!,3,FALSE)),0)","v":0},0,{"$f":"IF($E9=\"Established\",$M9,0)","v":0},{"$f":"IF($E9=\"Greenfield\",$M9*J9,0)","v":0},{"$f":"IF($E9=\"Greenfield\",$M9*K9,0)","v":0},688.59864145994777,{"$f":"IF($E9=\"Established\",$Q9,0)","v":688.59864145994777},{"$f":"IF($E9=\"Greenfield\",$Q9*J9,0)","v":0},{"$f":"IF($E9=\"Greenfield\",$Q9*K9,0)","v":0},{"$f":"N9+R9","v":688.59864145994777},{"$f":"O9+S9","v":0},{"$f":"P9+T9","v":0},{"$f":"L9*M9*K9","v":0},{"$f":"Q9*L9*K9","v":0}]
[102,"Calgary","Developed","DOWNTOWN WEST END","Established","EA",19.529433927300001,0,0,{"$f":"IF(H10>0,H10/G10,0)","v":0},{"$f":"IF(E10=\"Greenfield\",1-J10,0)","v":0},{"$f":"IF(F10=\"Current ASP\",IF(ISERROR(VLOOKUP(A10,#REF!,3,FALSE)),1,1-VLOOKUP(A10,#REF!,3,FALSE)),0)","v":0},3116.9105436700002,{"$f":"IF($E10=\"Established\",$M10,0)","v":3116.9105436700002},{"$f":"IF($E10=\"Greenfield\",$M10*J10,0)","v":0},{"$f":"IF($E10=\"Greenfield\",$M10*K10,0)","v":0},3005.9121491174146,{"$f":"IF($E10=\"Established\",$Q10,0)","v":3005.9121491174146},{"$f":"IF($E10=\"Greenfield\",$Q10*J10,0)","v":0},{"$f":"IF($E10=\"Greenfield\",$Q10*K10,0)","v":0},{"$f":"N10+R10","v":6122.8226927874148},{"$f":"O10+S10","v":0},{"$f":"P10+T10","v":0},{"$f":"L10*M10*K10","v":0},{"$f":"Q10*L10*K10","v":0}]
[103,"Calgary","Developed","DOWNTOWN COMMERCIAL CORE","Established","EA",6.0115446084200004,0,0,0,0,{"$f":"IF(F11=\"Current ASP\",IF(ISERROR(VLOOKUP(A11,#REF!,3,FALSE)),1,1-VLOOKUP(A11,#REF!,3,FALSE)),0)","v":0},1230.54245332,1230.54245332,0,0,1832.7000123154196,1832.7000123154196,0,0,3063.2424656354196,0,0,0,0]
[104,"Calgary","Developed","DOWNTOWN COMMERCIAL CORE","Established","EA",7.4294394670199999,0,0,0,0,{"$f":"IF(F12=\"Current ASP\",IF(ISERROR(VLOOKUP(A12,#REF!,3,FALSE)),1,1-VLOOKUP(A12,#REF!,3,FALSE)),0)","v":0},2335.6462907199998,2335.6462907199998,0,0,6211.8695150431422,6211.8695150431422,0,0,8547.5158057631415,0,0,0,0]
[105,"Calgary","Developed","DOWNTOWN COMMERCIAL CORE","Established","EA",11.0187338472,0,0,0,0,{"$f":"IF(F13=\"Current ASP\",IF(ISERROR(VLOOKUP(A13,#REF!,3,FALSE)),1,1-VLOOKUP(A13,#REF!,3,FALSE)),0)","v":0},2766.9063266399999,2766.9063266399999,0,0,4202.8421672052991,4202.8421672052991,0,0,6969.748493845299,0,0,0,0]
[106,"Calgary","Developed","EAU CLAIRE","Established","EA",3.6811381375700001,0,0,0,0,{"$f":"IF(F14=\"Current ASP\",IF(ISERROR(VLOOKUP(A14,#REF!,3,FALSE)),1,1-VLOOKUP(A14,#REF!,3,FALSE)),0)","v":0},0,0,0,0,1.9012725021212635,1.9012725021212635,0,0,1.9012725021212635,0,0,0,0]
[107,"Calgary","Developed","DOWNTOWN COMMERCIAL CORE","Established","EA",4.9236036589700003,0,0,0,0,{"$f":"IF(F15=\"Current ASP\",IF(ISERROR(VLOOKUP(A15,#REF!,3,FALSE)),1,1-VLOOKUP(A15,#REF!,3,FALSE)),0)","v":0},1086.0384178500001,1086.0384178500001,0,0,2747.9290223606035,2747.9290223606035,0,0,3833.9674402106039,0,0,0,0]
[108,"Calgary","Developed","DOWNTOWN COMMERCIAL CORE","Established","EA",7.2444390071600004,0,0,0,0,{"$f":"IF(F16=\"Current ASP\",IF(ISERROR(VLOOKUP(A16,#REF!,3,FALSE)),1,1-VLOOKUP(A16,#REF!,3,FALSE)),0)","v":0},777.51306433800005,777.51306433800005,0,0,10701.304245257372,10701.304245257372,0,0,11478.817309595372,0,0,0,0]
[109,"Calgary","Developed","DOWNTOWN COMMERCIAL CORE","Established","EA",7.3741500046199997,0,0,0,0,{"$f":"IF(F17=\"Current ASP\",IF(ISERROR(VLOOKUP(A17,#REF!,3,FALSE)),1,1-VLOOKUP(A17,#REF!,3,FALSE)),0)","v":0},339.75962257600003,339.75962257600003,0,0,7546.993057606398,7546.993057606398,0,0,7886.7526801823979,0,0,0,0]
[110,"Calgary","Developed","DOWNTOWN COMMERCIAL CORE","Established","EA",6.0772720741299997,0,0,0,0,{"$f":"IF(F18=\"Current ASP\",IF(ISERROR(VLOOKUP(A18,#REF!,3,FALSE)),1,1-VLOOKUP(A18,#REF!,3,FALSE)),0)","v":0},0,0,0,0,5400.3814195706282,5400.3814195706282,0,0,5400.3814195706282,0,0,0,0]
[111,"Calgary","Developed","DOWNTOWN COMMERCIAL CORE","Established","EA",2.969858651,0,0,0,0,{"$f":"IF(F19=\"Current ASP\",IF(ISERROR(VLOOKUP(A19,#REF!,3,FALSE)),1,1-VLOOKUP(A19,#REF!,3,FALSE)),0)","v":0},0,0,0,0,1160.253979795541,1160.253979795541,0,0,1160.253979795541,0,0,0,0]
[112,"Calgary","Developed","DOWNTOWN COMMERCIAL CORE","Established","EA",3.4752495056699999,0,0,0,0,{"$f":"IF(F20=\"Current ASP\",IF(ISERROR(VLOOKUP(A20,#REF!,3,FALSE)),1,1-VLOOKUP(A20,#REF!,3,FALSE)),0)","v":0},0,0,0,0,2144.9860685355929,2144.9860685355929,0,0,2144.9860685355929,0,0,0,0]
{"$rows_left_out":1390}
{"sheet":"Tab 6 - Benefit Calculation","index":6,"n_rows":15,"n_cols":2,"rows_kept":15,"cut":false,"hidden":false,"merged":[[1,0,3,4],[5,0,9,4]]}
["Transportation - Benefit Allocation"]
["This tab provides details on the benefit methodology. It shows the basis of the calculation and assumptions used in assessing benefit allocation. Detailed data supporting the calculation is shown on Tab 5."]
[]
[]
[]
["Per Tab 4, the infrastructure need (number of transit buses) is based on applying the population-to-fleet ratio to the forecast population of unlevied lands in approved greenfield Area Structure Plans. Benefit allocation considers that these additional buses are needed to provide transit service to these residents while maintaining citywide levels of service. 100% of the benefit of this expanded fleet is allocated to unlevied growth. "]
[]
[]
[]
[]
[]
[]
["Summary Data"]
["Benefit Rates for unlevied lands as at January 1, 2024:"]
["Greenfield",1]

{"sheet":"Tab 7 - Financial Model","index":7,"n_rows":46,"n_cols":46,"rows_kept":46,"cut":false,"hidden":false,"merged":[[40,1,42,4],[10,1,12,8],[3,1,8,8],[2,3,2,5],[31,6,34,6],[19,1,19,4],[20,1,21,2],[28,1,28,2],[27,1,27,2],[26,1,26,2],[29,1,37,2]]}
["Transit Bus OSL Financial Rate Model"]
["Last Updated: July 19, 2023",null,null,null,null,null,null,null,null,0,1,2,3,4,5,6,7,8,9,10,11,12,13,14,15,16,17,18,19,20,21,22,23,24,25,26,27,28,29,30,31,32,33,34,35]
["Transit Bus Levy Rate",null,19597.038770897932,"Run Macro <CTRL> + g",null,null,null,"End Value (CELL BS25):",{"$f":"AS38","v":0},2023,2024,2025,2026,2027,2028,2029,2030,2031,2032,2033,2034,2035,2036,2037,2038,2039,2040,2041,2042,2043,2044,2045,2046,2047,2048,2049,2050,2051,2052,2053,2054,2055,2056,2057,2058]
[null,"How to calculate the levy rate: Once all variables have been set, the levy rate can be recalculated by entering <CTRL> + g. This runs Excel's Goal Seek function (Data --> What-If Analysis --> Goal Seek) to calculate the levy rate in cell C3. The model applies the value in cell C3 to the land absorption in row 25, to ensure that contributions from development agreements (in row 30) plus earned investment income offset total spending and ensure that the ending balance is zero (cell AS38), i.e., all revenues and spending have balanced. \nVariables impacting this calculation include: annual expenditures, land absorption rate (row 25), payment schedule (cells I32 to I35), and the escalation and discount rates (cells E21 and E22)."]
[]
[]
[]
[]
[]
["Section 1: Expenditures"]
[null,"Section 1 below shows periodic expenditures. The assumptions driving expenditures are that 20 buses will be purchased whenever the transit levy fund has sufficient balance, and any remaining buses will be purchased in the final year to ensure that 225 are purchased over the model period."]
[]
[]
[]
["#","Project name","Cost per bus","# Greenfield buses","Leviable cost","Buses per purchase","# Purchases before final year","# Buses purchased before final year","Additional buses to purchase at end of period"]
[null,null,"Lookup","Lookup","Calc","Assumption","Calc","Calc","Calc"]
[1,"Transit buses",{"$f":"VLOOKUP(B17,'Tab 4 - Infrastructure'!A25:C25,3,FALSE)","v":732000},{"$f":"'Tab 4 - Infrastructure'!F25","v":237},{"$f":"D17*C17","v":173484000},20,{"$f":"COUNTIF(K17:AR17,\">0\")","v":11},{"$f":"G17*F17","v":220},{"$f":"D17-H17","v":17},null,{"$f":"IF(J38>($F17*$C17)*(1+$E$21)^K$2,($F17*$C17)*(1+$E$21)^K$2,0)","v":0},0,0,0,0,0,18727181.667919554,0,0,20811344.748275775,0,22328109.6841355,0,0,24813022.933924522,0,0,27574484.173952252,0,29584157.802703936,0,0,32876602.472125337,0,35272703.177921884,0,0,39198230.628414929,0,0,43560633.179941334,0,0,48408531.013179995,{"$f":"($I17*$C17)*(1+$E$21)^AS$2","v":42620322.959934063}]
[]
[]
[null,"Rates used to calculate future value and present value of leviable cost:"]
{"$rows_left_out":27}
{"sheet":"Version History","index":8,"n_rows":3,"n_cols":5,"rows_kept":3,"cut":false,"hidden":false,"merged":[]}
["Date","Where","Issue","Correction/ Comment","Status"]
["2023-07-19","First version issued for discussion","NA","NA","Complete"]
["2023-11-05","Tab 5 - Forecast Data","Forecast data was slightly out of date","Forecast data corrected to be consistent with the data in the community services levies","Complete"]

{"sheet":"Tab 3 - Financial Model (2)","index":9,"n_rows":25,"n_cols":41,"rows_kept":25,"cut":false,"hidden":true,"merged":[]}
[]
[]
["Escalation Rate",3.5299999999999998E-2]
["Discount",4.2900000000000001E-2]
[]
[null,"Current Cost","Year Projected project built",null,null,1,2,3,4,5,6,7,8,9,10,11,12,13,14,15,16,17,18,19,20,21,22,23,24,25,26,27,28,29,30,31,32,33,34,35,36]
[null,null,null,null,null,2022,2023,2024,2025,2026,2027,2028,2029,2030,2031,2032,2033,2034,2035,2036,2037,2038,2039,2040,2041,2042,2043,2044,2045,2046,2047,2048,2049,2050,2051,2052,2053,2054,2055,2056,2057]
[1,18000000,4,null,null,{"$f":"IF($C8=F$6,$B8,0)*(1+$B$3)^F$6","v":0},0,0,{"$f":"IF($C8=I$6,$B8,0)*(1+$B$3)^H$6","v":19974280.625585992},{"$f":"IF($C8=J$6,$B8,0)*(1+$B$3)^J$6","v":0},0,0,0,0,0,0,0,0,0,0,0,0,0,0,0,0,0,0,0,0,0,0,0,0,0,0,0,0]
[2,18000000,5,null,null,0,0,0,0,{"$f":"IF($C9=J$6,$B9,0)*(1+$B$3)^I$6","v":20679372.731669176},0,0,0,0,0,0,0,0,0,0,0,0,0,0,0,0,0,0,0,0,0,0,0,0,0,0,0,0]
[3,18000000,6,null,null,0,0,0,0,0,{"$f":"IF($C10=K$6,$B10,0)*(1+$B$3)^J$6","v":21409354.589097101},0,0,0,0,0,0,0,0,0,0,0,0,0,0,0,0,0,0,0,0,0,0,0,0,0,0,0]
[4,18000000,10,null,null,0,0,0,0,0,0,0,0,0,{"$f":"IF($C11=O$6,$B11,0)*(1+$B$3)^N$6","v":24596223.527356163},0,0,0,0,0,0,0,0,0,0,0,0,0,0,0,0,0,0,0,0,0,0,0]
[5,18000000,10,null,null,0,0,0,0,0,0,0,0,0,{"$f":"IF($C12=O$6,$B12,0)*(1+$B$3)^N$6","v":24596223.527356163},0,0,0,0,0,0,0,0,0,0,0,0,0,0,0,0,0,0,0,0,0,0,0]
[6,18000000,15,null,null,0,0,0,0,0,0,0,0,0,0,0,0,0,0,{"$f":"IF($C13=T$6,$B13,0)*(1+$B$3)^S$6","v":29254959.502770036},0,0,0,0,0,0,0,0,0,0,0,0,0,0,0,0,0,0]
[7,18000000,15,null,null,0,0,0,0,0,0,0,0,0,0,0,0,0,0,{"$f":"IF($C14=T$6,$B14,0)*(1+$B$3)^S$6","v":29254959.502770036},0,0,0,0,0,0,0,0,0,0,0,0,0,0,0,0,0,0]
[8,18000000,18,null,null,0,0,0,0,0,0,0,0,0,0,0,0,0,0,0,0,0,{"$f":"IF($C15=W$6,$B15,0)*(1+$B$3)^V$6","v":32463709.488804579},0,0,0,0,0,0,0,0,0,0,0,0,0,0,0]
[9,18000000,18,null,null,0,0,0,0,0,0,0,0,0,0,0,0,0,0,0,0,0,{"$f":"IF($C16=W$6,$B16,0)*(1+$B$3)^V$6","v":32463709.488804579},0,0,0,0,0,0,0,0,0,0,0,0,0,0,0]
[10,18000000,20,null,null,0,0,0,0,0,0,0,0,0,0,0,0,0,0,0,0,0,{"$f":"IF($C17=W$6,$B17,0)*(1+$B$3)^W$6","v":0},{"$f":"IF($C17=X$6,$B17,0)*(1+$B$3)^X$6","v":0},{"$f":"IF($C17=Y$6,$B17,0)*(1+$B$3)^X$6","v":34796100.08247108},0,0,0,0,0,0,0,0,0,0,0,0,0]
["Future value of capital projects",null,{"$f":"SUM(E18:AL18)","v":269488893.0666849},null,null,{"$f":"SUM(F8:F17)","v":0},0,0,19974280.625585992,20679372.731669176,21409354.589097101,0,0,0,49192447.054712325,0,0,0,0,58509919.005540073,0,0,64927418.977609158,0,34796100.08247108,0,0,0,0,0,0,0,0,0,0,0,0,0]
["Dicounted Amount",null,{"$f":"SUM(F19:AL19)","v":159269567.08616},null,null,{"$f":"(SUM(F8:F17))/((1+$B$4)^F6)","v":0},0,0,16884977.152049072,16761930.046520669,16639779.630993241,0,0,0,32320029.78167484,0,0,0,0,31159428.603664182,0,0,30483169.763425112,0,15020252.107832877,0,0,0,0,0,0,0,0,0,0,0,0,0]
[null,null,{"$f":"SUM(G20:AL20)","v":10202.799999999999},null,null,361,290,309,327,321,321,321.5,321.5,321.5,321.5,321.5,321.5,321.5,321.5,321.5,321.5,321.5,321.5,321.5,321.5,321.5,321.5,321.5,321.5,321.5,321.5,321.5,321.5,321.5,321.5,321.5,321.5,{"$f":"321.5-45.7","v":275.8}]
{"$rows_left_out":5}